NuSphere Forums Forum Index
NuSphere Forums
Reply to topic
Install problem on Linux RH9 (dbg 2.11.26)


Joined: 15 Jun 2004
Posts: 2
Reply with quote
Hi there,

While running deferphpize, I get the following error:

In file included from /usr/include/openssl/ssl.h:179,
from /usr/include/php/main/php_network.h:78,
from /home/attila/downloads/dbg-2.11.26-src/dbg.c:19:
/usr/include/openssl/kssl.h:72:18: krb5.h: No such file or directory
In file included from /usr/include/openssl/ssl.h:179,
from /usr/include/php/main/php_network.h:78,
from /home/attila/downloads/dbg-2.11.26-src/dbg.c:19:
/usr/include/openssl/kssl.h:132: parse error before "krb5_enctype"
/usr/include/openssl/kssl.h:134: parse error before "FAR"
/usr/include/openssl/kssl.h:135: parse error before '}' token
/usr/include/openssl/kssl.h:147: parse error before "kssl_ctx_setstring"
/usr/include/openssl/kssl.h:147: parse error before '*' token
/usr/include/openssl/kssl.h:148: parse error before '*' token
/usr/include/openssl/kssl.h:149: parse error before '*' token
/usr/include/openssl/kssl.h:149: parse error before '*' token
/usr/include/openssl/kssl.h:150: parse error before '*' token
/usr/include/openssl/kssl.h:151: parse error before "kssl_ctx_setprinc"
/usr/include/openssl/kssl.h:151: parse error before '*' token
/usr/include/openssl/kssl.h:153: parse error before "kssl_cget_tkt"
/usr/include/openssl/kssl.h:153: parse error before '*' token
/usr/include/openssl/kssl.h:155: parse error before "kssl_sget_tkt"
/usr/include/openssl/kssl.h:155: parse error before '*' token
/usr/include/openssl/kssl.h:157: parse error before "kssl_ctx_setkey"
/usr/include/openssl/kssl.h:157: parse error before '*' token
/usr/include/openssl/kssl.h:159: parse error before "context"
/usr/include/openssl/kssl.h:160: parse error before "kssl_build_principal_2"
/usr/include/openssl/kssl.h:160: parse error before "context"
/usr/include/openssl/kssl.h:163: parse error before "kssl_validate_times"
/usr/include/openssl/kssl.h:163: parse error before "atime"
/usr/include/openssl/kssl.h:165: parse error before "kssl_check_authent"
/usr/include/openssl/kssl.h:165: parse error before '*' token
/usr/include/openssl/kssl.h:167: parse error before "enctype"
In file included from /usr/include/php/main/php_network.h:78,
from /home/attila/downloads/dbg-2.11.26-src/dbg.c:19:
/usr/include/openssl/ssl.h:909: parse error before "KSSL_CTX"
/usr/include/openssl/ssl.h:931: parse error before '}' token
make: *** [dbg.lo] Error 1

Any suggestions would be much appreciated. Thanks in advance.
View user's profileFind all posts by HiggenkreuzSend private message
Site Admin

Joined: 13 Jul 2003
Posts: 7881
Reply with quote
Did you configure php by youself or installed pre-compiled php binaries ?
System you install dbg on has no krb5.h and therefore it's a php configuration problem.
View user's profileFind all posts by dmitriSend private messageVisit poster's website


Joined: 15 Jun 2004
Posts: 2
Reply with quote
Thanks,

Php was installed from an rpm package when I installed Linux. Is there a way to somehow reconfigure PHP or just copy the header file to an appropriate directory?
View user's profileFind all posts by HiggenkreuzSend private message
Site Admin

Joined: 13 Jul 2003
Posts: 7881
Reply with quote
that header has no relation to neither dbg nor php...
I see no way on how to proceed with what you have installed.
I'd recommend you compile php from sources
View user's profileFind all posts by dmitriSend private messageVisit poster's website


Joined: 24 Jun 2004
Posts: 3
Reply with quote
I have a problem which very looks like this one on my SuSE 9.0

-----------
In file included from /usr/local/src/dbg-2.11.26-src/dbg.c:19:
/usr/include/php/main/php_network.h:78:25: openssl/ssl.h: No such file or directory
In file included from /usr/local/src/dbg-2.11.26-src/dbg.c:19:
/usr/include/php/main/php_network.h:129: error: parse error before "SSL"
/usr/include/php/main/php_network.h:129: warning: no semicolon at end of struct or union
/usr/include/php/main/php_network.h:132: error: parse error before '}' token
/usr/include/php/main/php_network.h:162: error: parse error before "SSL_METHOD"
-----------

i tried to make ./configure --without-openssl (i don't need it) - the same error
so must i compile my php from sources or can be another way here?
View user's profileFind all posts by ppySend private message


Joined: 24 Jun 2004
Posts: 3
Reply with quote
ppy wrote:
I have a problem which very looks like this one on my SuSE 9.0


thanks. problem has been solved.
was not openssl-devel packages
View user's profileFind all posts by ppySend private message


Joined: 29 Jun 2004
Posts: 2
Reply with quote
I got the same error, so please tell me which package I have to install !

Thanks in advance
View user's profileFind all posts by BloodeyeSend private message
Site Admin

Joined: 13 Jul 2003
Posts: 7881
Reply with quote
install openssl-devel package.
View user's profileFind all posts by dmitriSend private messageVisit poster's website
Install problem on Linux RH9 (dbg 2.11.26)
You cannot post new topics in this forum
You cannot reply to topics in this forum
You cannot edit your posts in this forum
You cannot delete your posts in this forum
You cannot vote in polls in this forum
All times are GMT - 5 Hours  
Page 1 of 1  

  
  
 Reply to topic